{"text_format":"1","workbook":"xlsx","n_sheets":5,"sheets":["Instructions & Inputs",">>>","Model Inputs","Disclaimer","Model"],"not_rendered":{"charts":2,"images":0,"macros":1,"external_links":1,"defined_names":2910,"comments":0,"pivot_tables":0},"unopened":[],"bounds":{"document_bytes":16777216,"sheet_cells":100000,"rows_first":2000,"rows_last":500,"rows_between":2000,"halvings":0,"cell_chars":16384,"cell_head_chars":4096},"cells_cut":0,"cells_raw":0,"read":"whole","date_system":"1900"}

{"sheet":"Instructions & Inputs","index":0,"n_rows":44,"n_cols":9,"rows_kept":44,"cut":false,"hidden":false,"merged":[[38,1,38,12],[1,1,1,12],[3,1,3,12],[4,1,4,12],[37,1,37,12],[9,1,9,12],[5,1,5,12],[6,1,6,12],[11,8,11,9],[15,8,15,10],[13,8,13,9],[11,1,11,6]]}
[]
[null,"Whole-of-life costs model for sports fields"]
[]
[null,"Introduction"]
[null,"The Sport NZ Guidance Document for Sports Field Development highlights the importance of understanding the project's lifecycle costs. This includes the initial construction cost, ongoing maintenance cots, and future renewals. It is essential that ongoing maintenance costs and future renewals are effectively managed over time to optimise field performance and desired use outcomes. Therefore, it is crucial to understand your budget, which is aligned with performance expectations. "]
[]
[null,"The calculator has been designed for independent and customised use to suit the specific settings, conditions and costs of each sports field project. The customisable inputs are highlighted below."]
[]
[null,"More information can be found here:"]
[null,"Sport NZ's Guidance Document for Sports Field Development"]
[]
[null,"Key inputs (editable values in the model)",null,null,null,null,null,null,"Key outputs"]
[]
[null,"Financial Assumptions",null,null,null,null,null,null,"Annual Use Hours (by field type)"]
[null,"- Inflation"]
[null,"- Forward Risk Free Discount Rate",null,null,null,null,null,null,"Cost per Hour of Play (by field type)"]
[]
[null,"Construction Cost Input Assumptions",null,null,null,null,null,null,"End User Cost (for summer and winter activity)"]
[null,"- i.e. earthworks, construction, floodlights, project costs, other"]
[]
[null,"Maintenance Cost Assumptions"]
[null,"- Field of play costs, power, insurance, other"]
[]
[null,"Lifecycle Capex Assumptions"]
[null,"- Renewal periods can be added or amended"]
[]
[null,"Operational Assumptions"]
[null,"- Winter and summer activity hours and weeks"]
[]
[null,"Cost Recovery/Contribution"]
{"$rows_left_out":15}
{"sheet":">>>","index":1,"n_rows":0,"n_cols":0,"rows_kept":0,"cut":false,"hidden":false,"merged":[]}

{"sheet":"Model Inputs","index":2,"n_rows":87,"n_cols":11,"rows_kept":87,"cut":false,"hidden":false,"merged":[]}
[null,null,"Whole-of-Life cost model for soil, sand-carpet, hybrid and artificial sports fields"]
[null,null,"Financial assumptions"]
[null,null,null,null,null,null,null,null,null,"Commentary:","Graphical outputs"]
[null,null,"Cost input assumptions:",null,null,null,null,null,null,null,"Graphical Output (change field type here)"]
[null,null,"Inflation ","%",null,1.9E-2,"CPI Forecast | The Treasury New Zealand",null,null,"The overall general upward price movement of goods and services in an economy, usually as measured by the Consumer Price Index. ","Soil"]
[null,null,"Forward Risk Free Discount Rate (nominal)","%",null,5.9900000000000002E-2,"Discount Rate | The Treasury New Zealand",null,null,"A rate which reflects the difference in value of cash an investor would want in a years time in lieu of an equivalent cash payment today ( i.e. compound interest)"]
[]
[null,null,"Modelling to include inflation?","Yes/No",null,"Yes",null,null,null,"Real discount rate includes allowance for discount rate and  inflation. Only change if necessary "]
[null,null,"Modelled discount rate:","%",null,{"$f":"IF(F8=\"Yes\",F6,F6-F5)","v":5.9900000000000002E-2},null,null,null,"The discount rate which also takes into account inflation"]
[]
[null,null,"Input assumptions (GST exclusive):"]
[null,null,null,null,null,null,null,null,null,"Commentary:"]
[]
[null,null,"Construction cost input assumptions:",null,null,"Soil","Sand-Carpet","Hybrid","Artificial"]
[null,null,"Earthworks","NZ$",null,80000,85000,85000,85000]
[null,null,"Construction","NZ$",null,106000,428000,878000,2608000]
[null,null,"Floodlights","NZ$",null,null,280000,280000,280000]
[null,null,"Other (i.e. fencing, surrounds…)","NZ$",null,null,null,null,531000]
[null,null,"Project Costs (i.e. P&G, professional fees)","NZ$",null,67000,167000,212000,170000]
[null,null,"Total","NZ$",null,{"$f":"SUM(F15:F19)","v":253000},{"$f":"SUM(G15:G19)","v":960000},1455000,{"$f":"SUM(I15:I19)","v":3674000},"Capital costs can be estimated based on past experience.  Past costs will need to be indexed to present date rates"]
[]
[null,null,"Maintenance cost assumptions (annual):"]
[null,null,"Field of Play Costs","NZ$",null,20000,90000,90000,42000]
[null,null,"Power (i.e. for floodlights)","NZ$"]
[null,null,"Insurance","NZ$",null,null,null,null,7000]
[null,null,"Other","NZ$"]
[null,null,"Total ","NZ$",null,{"$f":"SUM(F23:F26)","v":20000},{"$f":"SUM(G23:G26)","v":90000},{"$f":"SUM(H23:H26)","v":90000},49000,"Maintenance costs can be estimated based on past experience.  Past costs will need to be indexed to present date rates"]
[]
[null,null,"Lifecycle capex assumptions:",null,null,null,null,null,null,"Renewal cost should include all remediation costs including  disposal of old carpet and drainage replacement"]
[null,null,"Renewal cost - 3 Years","NZ$",3,null,null,87000]
{"$rows_left_out":58}
{"sheet":"Disclaimer","index":3,"n_rows":2,"n_cols":2,"rows_kept":2,"cut":false,"hidden":false,"merged":[[1,1,35,11]]}
[]
[null,"DISCLAIMER\n\nThis financial model (\"the Model\") and the accompanying assumptions have been prepared by Sport NZ with assistance from Visitor Solutions. The Model has been developed as a general planning and decision-support tool to assist organisations in assessing the potential financial performance of sport and recreation facility projects.\n\nThe Model is made publicly available for information and planning purposes only. While reasonable care has been taken in its preparation, Sport NZ and Visitor Solutions make no representation or warranty, express or implied, as to the accuracy, completeness, reliability or suitability of the Model or the assumptions contained within it for any particular purpose.\n\nThe Model includes forecasts and financial projections that are based on assumptions and estimates. Forecasts are inherently uncertain and involve future events and circumstances, many of which are beyond the control of Sport NZ, Visitor Solutions and the organisations using the Model. Actual results are likely to differ from those forecast, and such differences may be material.\n\nUsers are responsible for reviewing, validating and adapting the assumptions and inputs to reflect their own circumstances. The outputs generated by the Model should not be relied upon as the sole basis for investment, funding or business decisions and do not constitute financial, legal, accounting or professional advice. Users should obtain independent professional advice where appropriate.\n\nTo the fullest extent permitted by law, Sport NZ and Visitor Solutions, including their respective affiliates, directors, employees and agents, accept no liability for any loss, damage, cost or expense arising directly or indirectly from the use of, or reliance on, the Model or any outputs it produces.\n\nJune 2026"]

{"sheet":"Model","index":4,"n_rows":126,"n_cols":36,"rows_kept":126,"cut":false,"hidden":false,"merged":[]}
[]
[null,"Do not edit: The following sheet is for reference only.  This sheet includes all the workings that are represented in the Model inputs sheet."]
[]
[null,"Year",null,null,0,1,2,3,4,5,6,7,8,9,10,11,12,13,14,15,16,17,18,19,20,21,22,23,24,25,26,27,28,29,30,"Total"]
[]
[null,"Inflation Rate","%",{"$f":"'Model Inputs'!F5*IF('Model Inputs'!F8=\"No\",0,1)","v":1.9E-2}]
[null,"Capex Timing","Flag:",null,1]
[null,"Replacement Cycle:"]
[null,{"$f":"'Model Inputs'!E30","v":3},"Flag:",null,null,{"$f":"IF(MOD(F$4,$B9)=0,1,0)","v":0},{"$f":"IF(MOD(G$4,$B9)=0,1,0)","v":0},1,0,0,1,0,0,1,0,0,1,0,0,1,0,0,1,0,0,1,0,0,1,0,0,1,0,0,1]
[null,{"$f":"'Model Inputs'!E31","v":10},"Flag:",null,null,{"$f":"IF(MOD(F$4,$B10)=0,1,0)","v":0},0,0,0,0,0,0,0,0,1,0,0,0,0,0,0,0,0,0,1,0,0,0,0,0,0,0,0,0,1]
[null,{"$f":"'Model Inputs'!E32","v":15},"Flag:",null,null,0,0,0,0,0,0,0,0,0,0,0,0,0,0,1,0,0,0,0,0,0,0,0,0,0,0,0,0,0,1]
[null,{"$f":"'Model Inputs'!E33","v":20},"Flag:",null,null,0,0,0,0,0,0,0,0,0,0,0,0,0,0,0,0,0,0,0,1,0,0,0,0,0,0,0,0,0,0]
[]
[null,"SOIL"]
[null,"COSTS:"]
[null,"Construction","NZ$:",{"$f":"'Model Inputs'!$F$20","v":253000},{"$f":"-$D16*E$7","v":-253000},{"$f":"-$D16*F$7","v":0},0,0,0,0,0,0,0,0,0,0,0,0,0,0,0,0,0,0,0,0,0,0,0,0,0,0,0,0,0,{"$f":"SUM(E16:AI16)","v":-253000}]
[null,"Maintenance","NZ$:",{"$f":"'Model Inputs'!$F$27","v":20000},null,{"$f":"-$D17*(1+$D$6)^F$4","v":-20379.999999999996},{"$f":"-$D17*(1+$D$6)^G$4","v":-20767.219999999998},-21161.797179999998,-21563.871326419998,-21973.584881621973,-22391.082994372791,-22816.513571265874,-23250.027329119923,-23691.7778483732,-24141.921627492291,-24600.618138414644,-25068.029883044521,-25544.322450822361,-26029.664577387994,-26524.228204358362,-27028.188540241168,-27541.724122505751,-28065.016880833355,-28598.25220156919,-29141.618993399003,-29695.309754273581,-30259.520639604783,-30834.45153175727,-31420.30611086066,-32017.291926967006,-32625.62047357938,-33245.50726257739,-33877.171900566354,-34520.838166677109,-35176.73409184398,{"$f":"SUM(E17:AI17)","v":-813952.21260994987}]
[null,"Replacement costs:"]
[null,{"$f":"'Model Inputs'!C30","v":"Renewal cost - 3 Years"},"NZ$:",{"$f":"'Model Inputs'!F30","v":0},null,{"$f":"-$D19*F$9*(1+$D$6)^F$4","v":0},{"$f":"-$D19*G$9*(1+$D$6)^G$4","v":0},0,0,0,0,0,0,0,0,0,0,0,0,0,0,0,0,0,0,0,0,0,0,0,0,0,0,0,0,{"$f":"SUM(E19:AI19)","v":0}]
[null,{"$f":"'Model Inputs'!C31","v":"Renewal cost - 10 Years"},"NZ$:",{"$f":"'Model Inputs'!F31","v":0},null,{"$f":"-$D20*F$10*(1+$D$6)^F$4","v":0},{"$f":"-$D20*G$10*(1+$D$6)^G$4","v":0},0,0,0,0,0,0,0,0,0,0,0,0,0,0,0,0,0,0,0,0,0,0,0,0,0,0,0,0,0]
[null,{"$f":"'Model Inputs'!C32","v":"Renewal cost - 15 Years"},"NZ$:",{"$f":"'Model Inputs'!F32","v":0},null,{"$f":"-$D21*F$11*(1+$D$6)^F$4","v":0},{"$f":"-$D21*G$11*(1+$D$6)^G$4","v":0},0,0,0,0,0,0,0,0,0,0,0,0,0,0,0,0,0,0,0,0,0,0,0,0,0,0,0,0,0]
[null,{"$f":"'Model Inputs'!C33","v":"Renewal cost - 20 Years"},"NZ$:",{"$f":"'Model Inputs'!F33","v":0},null,{"$f":"-$D22*F$12*(1+$D$6)^F$4","v":0},{"$f":"-$D22*G$12*(1+$D$6)^G$4","v":0},0,0,0,0,0,0,0,0,0,0,0,0,0,0,0,0,0,0,0,0,0,0,0,0,0,0,0,0,0]
[]
[null,"Total Cash Outflows","NZ$:",null,{"$f":"SUM(E16:E22)","v":-253000},{"$f":"SUM(F16:F22)","v":-20379.999999999996},-20767.219999999998,-21161.797179999998,-21563.871326419998,-21973.584881621973,-22391.082994372791,-22816.513571265874,-23250.027329119923,-23691.7778483732,-24141.921627492291,-24600.618138414644,-25068.029883044521,-25544.322450822361,-26029.664577387994,-26524.228204358362,-27028.188540241168,-27541.724122505751,-28065.016880833355,-28598.25220156919,-29141.618993399003,-29695.309754273581,-30259.520639604783,-30834.45153175727,-31420.30611086066,-32017.291926967006,-32625.62047357938,-33245.50726257739,-33877.171900566354,-34520.838166677109,-35176.73409184398,-1066952.21260995]
[]
[null,"Revenue:"]
[null,"Game revenue","NZ$:",null,null,{"$f":"'Model Inputs'!$F$58*'Model Inputs'!$F$65*(1+$D$6)^F$4","v":11151.753103409572},{"$f":"'Model Inputs'!$F$58*'Model Inputs'!$F$65*(1+$D$6)^G$4","v":11363.636412374353},{"$f":"'Model Inputs'!$F$58*'Model Inputs'!$F$65*(1+$D$6)^H$4","v":11579.545504209465},{"$f":"'Model Inputs'!$F$58*'Model Inputs'!$F$65*(1+$D$6)^I$4","v":11799.556868789445},{"$f":"'Model Inputs'!$F$58*'Model Inputs'!$F$65*(1+$D$6)^J$4","v":12023.748449296443},{"$f":"'Model Inputs'!$F$58*'Model Inputs'!$F$65*(1+$D$6)^K$4","v":12252.199669833077},{"$f":"'Model Inputs'!$F$58*'Model Inputs'!$F$65*(1+$D$6)^L$4","v":12484.991463559905},{"$f":"'Model Inputs'!$F$58*'Model Inputs'!$F$65*(1+$D$6)^M$4","v":12722.206301367542},{"$f":"'Model Inputs'!$F$58*'Model Inputs'!$F$65*(1+$D$6)^N$4","v":12963.928221093523},{"$f":"'Model Inputs'!$F$58*'Model Inputs'!$F$65*(1+$D$6)^O$4","v":13210.242857294301},{"$f":"'Model Inputs'!$F$58*'Model Inputs'!$F$65*(1+$D$6)^P$4","v":13461.237471582892},{"$f":"'Model Inputs'!$F$58*'Model Inputs'!$F$65*(1+$D$6)^Q$4","v":13717.000983542965},{"$f":"'Model Inputs'!$F$58*'Model Inputs'!$F$65*(1+$D$6)^R$4","v":13977.624002230279},{"$f":"'Model Inputs'!$F$58*'Model Inputs'!$F$65*(1+$D$6)^S$4","v":14243.198858272657},{"$f":"'Model Inputs'!$F$58*'Model Inputs'!$F$65*(1+$D$6)^T$4","v":14513.819636579838},{"$f":"'Model Inputs'!$F$58*'Model Inputs'!$F$65*(1+$D$6)^U$4","v":14789.582209674852},{"$f":"'Model Inputs'!$F$58*'Model Inputs'!$F$65*(1+$D$6)^V$4","v":15070.584271658674},{"$f":"'Model Inputs'!$F$58*'Model Inputs'!$F$65*(1+$D$6)^W$4","v":15356.925372820187},{"$f":"'Model Inputs'!$F$58*'Model Inputs'!$F$65*(1+$D$6)^X$4","v":15648.706954903771},{"$f":"'Model Inputs'!$F$58*'Model Inputs'!$F$65*(1+$D$6)^Y$4","v":15946.032387046942},{"$f":"'Model Inputs'!$F$58*'Model Inputs'!$F$65*(1+$D$6)^Z$4","v":16249.007002400833},{"$f":"'Model Inputs'!$F$58*'Model Inputs'!$F$65*(1+$D$6)^AA$4","v":16557.738135446452},{"$f":"'Model Inputs'!$F$58*'Model Inputs'!$F$65*(1+$D$6)^AB$4","v":16872.335160019931},{"$f":"'Model Inputs'!$F$58*'Model Inputs'!$F$65*(1+$D$6)^AC$4","v":17192.909528060311},{"$f":"'Model Inputs'!$F$58*'Model Inputs'!$F$65*(1+$D$6)^AD$4","v":17519.574809093454},{"$f":"'Model Inputs'!$F$58*'Model Inputs'!$F$65*(1+$D$6)^AE$4","v":17852.446730466228},{"$f":"'Model Inputs'!$F$58*'Model Inputs'!$F$65*(1+$D$6)^AF$4","v":18191.643218345085},{"$f":"'Model Inputs'!$F$58*'Model Inputs'!$F$65*(1+$D$6)^AG$4","v":18537.28443949364},{"$f":"'Model Inputs'!$F$58*'Model Inputs'!$F$65*(1+$D$6)^AH$4","v":18889.492843844015},{"$f":"'Model Inputs'!$F$58*'Model Inputs'!$F$65*(1+$D$6)^AI$4","v":19248.393207877059},{"$f":"SUM(E27:AI27)","v":445387.34607458755}]
[null,"Training revenue","NZ$:",null,null,{"$f":"'Model Inputs'!$F$59*'Model Inputs'!$F$65*(1+$D$6)^F$4","v":24162.13172405407},{"$f":"'Model Inputs'!$F$59*'Model Inputs'!$F$65*(1+$D$6)^G$4","v":24621.212226811098},{"$f":"'Model Inputs'!$F$59*'Model Inputs'!$F$65*(1+$D$6)^H$4","v":25089.015259120508},{"$f":"'Model Inputs'!$F$59*'Model Inputs'!$F$65*(1+$D$6)^I$4","v":25565.706549043796},{"$f":"'Model Inputs'!$F$59*'Model Inputs'!$F$65*(1+$D$6)^J$4","v":26051.454973475626},{"$f":"'Model Inputs'!$F$59*'Model Inputs'!$F$65*(1+$D$6)^K$4","v":26546.432617971666},{"$f":"'Model Inputs'!$F$59*'Model Inputs'!$F$65*(1+$D$6)^L$4","v":27050.814837713126},{"$f":"'Model Inputs'!$F$59*'Model Inputs'!$F$65*(1+$D$6)^M$4","v":27564.780319629674},{"$f":"'Model Inputs'!$F$59*'Model Inputs'!$F$65*(1+$D$6)^N$4","v":28088.511145702632},{"$f":"'Model Inputs'!$F$59*'Model Inputs'!$F$65*(1+$D$6)^O$4","v":28622.192857470982},{"$f":"'Model Inputs'!$F$59*'Model Inputs'!$F$65*(1+$D$6)^P$4","v":29166.014521762932},{"$f":"'Model Inputs'!$F$59*'Model Inputs'!$F$65*(1+$D$6)^Q$4","v":29720.168797676422},{"$f":"'Model Inputs'!$F$59*'Model Inputs'!$F$65*(1+$D$6)^R$4","v":30284.852004832272},{"$f":"'Model Inputs'!$F$59*'Model Inputs'!$F$65*(1+$D$6)^S$4","v":30860.264192924089},{"$f":"'Model Inputs'!$F$59*'Model Inputs'!$F$65*(1+$D$6)^T$4","v":31446.609212589647},{"$f":"'Model Inputs'!$F$59*'Model Inputs'!$F$65*(1+$D$6)^U$4","v":32044.094787628848},{"$f":"'Model Inputs'!$F$59*'Model Inputs'!$F$65*(1+$D$6)^V$4","v":32652.932588593794},{"$f":"'Model Inputs'!$F$59*'Model Inputs'!$F$65*(1+$D$6)^W$4","v":33273.33830777707},{"$f":"'Model Inputs'!$F$59*'Model Inputs'!$F$65*(1+$D$6)^X$4","v":33905.531735624842},{"$f":"'Model Inputs'!$F$59*'Model Inputs'!$F$65*(1+$D$6)^Y$4","v":34549.736838601704},{"$f":"'Model Inputs'!$F$59*'Model Inputs'!$F$65*(1+$D$6)^Z$4","v":35206.181838535136},{"$f":"'Model Inputs'!$F$59*'Model Inputs'!$F$65*(1+$D$6)^AA$4","v":35875.099293467312},{"$f":"'Model Inputs'!$F$59*'Model Inputs'!$F$65*(1+$D$6)^AB$4","v":36556.726180043181},{"$f":"'Model Inputs'!$F$59*'Model Inputs'!$F$65*(1+$D$6)^AC$4","v":37251.303977464006},{"$f":"'Model Inputs'!$F$59*'Model Inputs'!$F$65*(1+$D$6)^AD$4","v":37959.078753035814},{"$f":"'Model Inputs'!$F$59*'Model Inputs'!$F$65*(1+$D$6)^AE$4","v":38680.301249343494},{"$f":"'Model Inputs'!$F$59*'Model Inputs'!$F$65*(1+$D$6)^AF$4","v":39415.226973081022},{"$f":"'Model Inputs'!$F$59*'Model Inputs'!$F$65*(1+$D$6)^AG$4","v":40164.116285569551},{"$f":"'Model Inputs'!$F$59*'Model Inputs'!$F$65*(1+$D$6)^AH$4","v":40927.234494995369},{"$f":"'Model Inputs'!$F$59*'Model Inputs'!$F$65*(1+$D$6)^AI$4","v":41704.851950400291},965005.91649493994]
[null,"Total Revenue","NZ$:",null,{"$f":"SUM(E27:E28)","v":0},{"$f":"SUM(F27:F28)","v":35313.88482746364},35984.848639185453,36668.560763329973,37365.263417833237,38075.203422772072,38798.632287804743,39535.806301273027,40286.986620997217,41052.439366796156,41832.435714765285,42627.251993345824,43437.169781219389,44262.476007062549,45103.463051196748,45960.428849169482,46833.676997303701,47723.516860252465,48630.263680597258,49554.238690528611,50495.769225648648,51455.188840935967,52432.837428913765,53429.061340063112,54444.213505524312,55478.653562129271,56532.747979809719,57606.870191426104,58701.400725063191,59816.727338839381,60953.24515827735,1410393.2625695276]
[]
{"$rows_left_out":96}